{"text_format":"3","workbook":"xlsx","n_sheets":10,"sheets":["Intro","Cover","Expense_Entry","Reim_Summary","Reim_Detail","ExpenseDB","NonReim_Summary","NonReim_Detail","Rules","ChangeLog"],"not_rendered":{"defined_names":40,"comments":2,"pivot_tables":4},"read":"whole","date_system":"1900"}

{"sheet":"Intro","index":0,"n_rows":20,"n_cols":2,"rows_kept":20}
["Expenses"]
["Multicurrency Expense Form With Automatic Categorisation Summary"]
["Description:","This expense tracking form is to allow you to capture expenses incurred while performing work for a client; expenses to be reimbursed by the client in that client's home currency, and expenses that will not be reimbursed.  The non-reimbursable expenses reconcile themselves differently since the workbook assumes you will be paying for them in your home currency (which may differ from the client's currency)."]
["Version:",14.2]
["Date:","2011-08-13"]
["Eval:","Take a look at the sample data on the \"Reim_Detail\" worksheets and the way it is presented in the and \"Reim_Summary\" and \"ExpenseDB\" worksheets.  Once you are comfortable with how things look, delete the sample data."]
["Install:","1. Go to the Rules tab and enter your home (that is, reimbursement) currency into the \"Actual\n     Home Currency\" cell."]
[null,"2. Put the template in your MS Office templates folder."]
["Usage:","1. Go to the \"Cover\" worksheet and enter covering detail for the expense report."]
[null,"2. Go to the \"Reim_Detail\" worksheet and enter your client's currency."]
[null,"3. Go to the \"Expense_Entry\" worksheet and enter your expense data; including the actual\n     amount that you were charged by the credit card companies or as a result of currency\n     conversion."]
[null,"          Note 1: green shaded cells are for data entry."]
[null,"          Note 2: the \"Expense_Entry\" worksheet is populated with sample data to demonstrate\n                          how this workbook is used; however, it's setup so that when you navigate there is\n                          you press the [Delete] key then all of the sample data will be erased with a single\n                          key press."]
[null,"4. If you need to insert additional \"Expense_Entry\" rows, you will need to also insert additional\n     rows into the \"Reim_Detail\" and \"ExpenseDB\" worksheet and adjust their formulas."]
[null,"5. Go to the \"Reim_Summary\" and \"ExpenseDB\" worksheets and refresh the crosstabs."]
{"$rows_left_out":6}
{"sheet":"Cover","index":1,"n_rows":17,"n_cols":4,"rows_kept":17}
[null,{"$f":"CONCATENATE(\"Expense Report—\",Employee,\" [ Week \",IF(10>WEEKNUM(Trip_Start,1),\"0\",\"\"),WEEKNUM(Trip_Start,1),\" ]\")","v":"Expense Report—Employee Name [ Week 14 ]"}]
[]
[null,"Employee:","Employee Name"]
[null,"Trip Start: ","2004-03-29"]
[null,"Trip End: "]
[null,"Client: ","Client Name"]
[null,"Destination: ","Politsania"]
[null,"Purpose: ","Demo data"]
[null,"Mileage Rate: ",{"v":55.5,"d":"55.5 ¢/mi."}]
[null,"Reimbursement Currency: ","CAD",{"$f":"IF(VLOOKUP(C10,FX_Rate_Tbl,2,FALSE())=1,\"\",\"ERROR: Your reimbursement currency must have an FX Rate of '1' in the table below.\")","v":""}]
[]
[null,null,"Currency","FX Rate"]
[null,null,"CAD",{"v":1,"d":"1.0000"}]
[null,null,"USD",{"v":0.9370314842578711,"d":"0.9370"}]
[null,null,"SGD",{"v":1.2484342379958246,"d":"1.2484"}]
{"$rows_left_out":3}
{"sheet":"Expense_Entry","index":2,"n_rows":71,"n_cols":11,"rows_kept":71}
[{"$f":"Cover!B1","v":"Expense Report—Employee Name [ Week 14 ]"}]
[]
[{"$f":"Cover!B4","v":"Trip Start: "},{"$f":"Trip_Start","v":"2004-03-29"},null,"Total Amount: ",{"$f":"Total_Est_Reim_Amt","v":{"v":14285.800000000008,"d":"$14,285.80"}},null,"Currency","FX Rate"]
[{"$f":"Cover!B5","v":"Trip End: "},{"$f":"Trip_End","v":"00:00:00"},null,{"$f":"Cover!B10","v":"Reimbursement Currency: "},{"$f":"Reimbursement_Currency","v":"CAD"},{"$f":"IF(H4=1,\"Home→\",\"\")","v":"Home→"},{"$f":"INDEX(Cover!FX_Names,ROW(G4)-3,1)","v":"CAD"},{"$f":"VLOOKUP(G4,Cover!FX_Rate_Tbl,2,FALSE)","v":{"v":1,"d":"1.0000"}}]
[{"$f":"Cover!B6","v":"Client: "},{"$f":"Client","v":"Client Name"},{"$nulls":3},{"$f":"IF(H5=1,\"Home→\",\"\")","v":""},{"$f":"INDEX(Cover!FX_Names,ROW(G5)-3,1)","v":"USD"},{"$f":"VLOOKUP(G5,Cover!FX_Rate_Tbl,2,FALSE)","v":{"v":0.9370314842578711,"d":"0.9370"}}]
[{"$f":"Cover!B7","v":"Destination: "},{"$f":"Destination","v":"Politsania"},{"$nulls":3},"",{"$f":"INDEX(Cover!FX_Names,ROW(G6)-3,1)","v":"SGD"},{"$f":"VLOOKUP(G6,Cover!FX_Rate_Tbl,2,FALSE)","v":{"v":1.2484342379958246,"d":"1.2484"}}]
[{"$f":"Cover!B8","v":"Purpose: "},{"$f":"Purpose","v":"Demo data"},{"$nulls":3},"",{"$f":"INDEX(Cover!FX_Names,ROW(G7)-3,1)","v":"HKG"},{"$f":"VLOOKUP(G7,Cover!FX_Rate_Tbl,2,FALSE)","v":{"v":7.807807807807808,"d":"7.8078"}}]
[{"$nulls":5},"",{"$f":"INDEX(Cover!FX_Names,ROW(G8)-3,1)","v":"Other 1"},{"$f":"VLOOKUP(G8,Cover!FX_Rate_Tbl,2,FALSE)","v":0},null,"In Reimbursement $"]
[{"$nulls":7},"Estimated",null,"Actual"]
["Date","Establishment","Description","Type","Method","Currency","Exp. Amt.","Home Amt.","-","Levied Amt.","Difference"]
["2011-03-11","Mileage","Drive to/from YOW (38 miles)","Mileage","Mileage","USD",{"$f":"38*MileageRate/100","v":{"v":21.09,"d":"$21.09"}},{"$f":"IF(OR(ISBLANK(F11),ISBLANK(G11)),\"\",ROUND(G11/VLOOKUP(F11,FX_Rate_Tbl,2,FALSE),2))","v":{"v":22.51,"d":"$22.51"}},null,{"$f":"VLOOKUP(F11,Cover!FX_Rate_Tbl,2,FALSE)/VLOOKUP(Reimbursement_Currency,Cover!FX_Rate_Tbl,2,FALSE)*G11","v":{"v":19.761994002998502,"d":"$19.76"}},{"$f":"IF(Reimbursement_Currency=F11,0,IF(ISBLANK(J11),STR_TBD,ROUND(J11-H11,2)))","v":{"v":-2.75,"d":"$(2.75)"}}]
["2011-03-11","Ottawa Airport","Parking","Parking","AMEX","CAD",{"v":6,"d":"$6.00"},{"v":6,"d":"$6.00"},null,null,0]
["2011-03-11","Cold Storage","Dinner","Meals","AMEX","SGD",{"v":8.6,"d":"$8.60"},{"v":6.89,"d":"$6.89"},null,{"v":6.82,"d":"$6.82"},{"v":-0.07,"d":"$(0.07)"}]
["2011-03-11","Starbucks","Coffee","Meals","AMEX","SGD",{"v":7.9,"d":"$7.90"},{"v":6.33,"d":"$6.33"},null,{"v":6.27,"d":"$6.27"},{"v":-0.06,"d":"$(0.06)"}]
["2011-03-12","Starbucks","Coffee","Meals","AMEX","CAD",{"v":4.71,"d":"$4.71"},{"v":4.71,"d":"$4.71"},null,null,0]
{"$rows_left_out":57}
{"sheet":"Reim_Summary","index":3,"n_rows":24,"n_cols":11,"rows_kept":24}
[null,{"$f":"Reim_Detail!A1","v":"Expense Report—Employee Name [ Week 14 ]"}]
[]
[null,{"$f":"Cover!B4","v":"Trip Start: "},{"$f":"Trip_Start","v":"2004-03-29"},{"$nulls":3},{"$f":"Reim_Detail!D3","v":"Total Amount: "},{"$f":"Total_Est_Client_Amt","v":{"v":17834.82000000001,"d":"$17,834.82"}}]
[null,{"$f":"Cover!B5","v":"Trip End: "},{"$f":"Trip_End","v":"00:00:00"},{"$nulls":3},{"$f":"Reim_Detail!D4","v":"Client Currency: "},{"$f":"Client_Currency","v":"SGD"}]
[null,{"$f":"Cover!B6","v":"Client: "},{"$f":"Client","v":"Client Name"}]
[null,{"$f":"Cover!B7","v":"Destination: "},{"$f":"Destination","v":"Politsania"}]
[null,{"$f":"Cover!B8","v":"Purpose: "},{"$f":"Purpose","v":"Demo data"}]
[]
[null,"Sum of Client Amt.","Type"]
[null,"Date","Airfare","Hotel","Meals","Mileage","Misc.","Parking","Phone","Taxi","Grand Total"]
[null,"2011-03-11",null,null,{"v":16.5,"d":"$16.50"},{"v":25.82,"d":"$25.82"},null,{"v":7.49,"d":"$7.49"},null,null,{"v":49.81,"d":"$49.81"}]
[null,"2011-03-12",{"v":13733.79,"d":"$13,733.79"},{"v":167.88,"d":"$167.88"},{"v":60.09,"d":"$60.09"},{"$nulls":4},{"v":24.97,"d":"$24.97"},{"v":13986.73,"d":"$13,986.73"}]
[null,"2011-03-13",null,{"v":6.24,"d":"$6.24"},{"v":6.55,"d":"$6.55"},null,{"v":3.12,"d":"$3.12"},{"$nulls":3},{"v":15.91,"d":"$15.91"}]
[null,"2011-03-14",null,{"v":335.45,"d":"$335.45"},{"$nulls":6},{"v":335.45,"d":"$335.45"}]
[null,"2011-03-15",null,{"v":335.45,"d":"$335.45"},{"v":9.899999999999999,"d":"$9.90"},null,{"v":25,"d":"$25.00"},null,{"v":18,"d":"$18.00"},{"v":30.55,"d":"$30.55"},{"v":418.9,"d":"$418.90"}]
{"$rows_left_out":10}
{"sheet":"Reim_Detail","index":4,"n_rows":71,"n_cols":8,"rows_kept":71}
[{"$f":"Cover!B1","v":"Expense Report—Employee Name [ Week 14 ]"}]
[]
[{"$f":"Cover!B4","v":"Trip Start: "},{"$f":"Trip_Start","v":"2004-03-29"},null,"Total Amount: ",{"$f":"Total_Est_Client_Amt","v":{"v":17834.82000000001,"d":"$17,834.82"}},null,"Currency","FX Rate"]
[{"$f":"Cover!B5","v":"Trip End: "},{"$f":"Trip_End","v":"00:00:00"},null,"Client Currency: ","SGD",{"$f":"IF(H4=1,\"Client→\",\"\")","v":""},{"$f":"INDEX(Cover!FX_Names,ROW(G4)-3,1)","v":"CAD"},{"$f":"VLOOKUP(G4,Cover!FX_Rate_Tbl,2,FALSE)/VLOOKUP(Client_Currency,Cover!FX_Rate_Tbl,2,FALSE)","v":{"v":0.8010033444816054,"d":"0.8010"}}]
[{"$f":"Cover!B6","v":"Client: "},{"$f":"Client","v":"Client Name"},{"$nulls":3},{"$f":"IF(H5=1,\"Client→\",\"\")","v":""},{"$f":"INDEX(Cover!FX_Names,ROW(G5)-3,1)","v":"USD"},{"$f":"VLOOKUP(G5,Cover!FX_Rate_Tbl,2,FALSE)/VLOOKUP(Client_Currency,Cover!FX_Rate_Tbl,2,FALSE)","v":{"v":0.7505653527751175,"d":"0.7506"}}]
[{"$f":"Cover!B7","v":"Destination: "},{"$f":"Destination","v":"Politsania"},{"$nulls":3},"Client→",{"$f":"INDEX(Cover!FX_Names,ROW(G6)-3,1)","v":"SGD"},{"$f":"VLOOKUP(G6,Cover!FX_Rate_Tbl,2,FALSE)/VLOOKUP(Client_Currency,Cover!FX_Rate_Tbl,2,FALSE)","v":{"v":1,"d":"1.0000"}}]
[{"$f":"Cover!B8","v":"Purpose: "},{"$f":"Purpose","v":"Demo data"},{"$nulls":3},"",{"$f":"INDEX(Cover!FX_Names,ROW(G7)-3,1)","v":"HKG"},{"$f":"VLOOKUP(G7,Cover!FX_Rate_Tbl,2,FALSE)/VLOOKUP(Client_Currency,Cover!FX_Rate_Tbl,2,FALSE)","v":{"v":6.254080167123646,"d":"6.2541"}}]
[{"$nulls":5},"",{"$f":"INDEX(Cover!FX_Names,ROW(G8)-3,1)","v":"Other 1"},{"$f":"VLOOKUP(G8,Cover!FX_Rate_Tbl,2,FALSE)/VLOOKUP(Client_Currency,Cover!FX_Rate_Tbl,2,FALSE)","v":0}]
[{"$nulls":7},"Calculated"]
["Date","Establishment","Description","Type","Method","Currency","Exp. Amt.","Client Amt."]
[{"$f":"IF(ISBLANK(Expense_Entry!A11),\"\",Expense_Entry!A11)","v":"2011-03-11"},{"$f":"IF(ISBLANK(Expense_Entry!B11),\"\",Expense_Entry!B11)","v":"Mileage"},{"$f":"IF(ISBLANK(Expense_Entry!C11),\"\",Expense_Entry!C11)","v":"Drive to/from YOW (38 miles)"},{"$f":"IF(ISBLANK(Expense_Entry!D11),\"\",Expense_Entry!D11)","v":"Mileage"},{"$f":"IF(ISBLANK(Expense_Entry!E11),\"\",Expense_Entry!E11)","v":"Mileage"},{"$f":"IF(ISBLANK(Expense_Entry!F11),\"\",Expense_Entry!F11)","v":"USD"},{"$f":"IF(ISBLANK(Expense_Entry!G11),\"\",Expense_Entry!G11)","v":{"v":21.09,"d":"$21.09"}},{"$f":"IF(OR(F11=\"\",G11=\"\"),\"\",ROUND(G11/VLOOKUP(F11,FX_Rate_Tbl,2,FALSE),2))","v":{"v":28.1,"d":"$28.10"}}]
[{"$f":"IF(ISBLANK(Expense_Entry!A12),\"\",Expense_Entry!A12)","v":"2011-03-11"},{"$f":"IF(ISBLANK(Expense_Entry!B12),\"\",Expense_Entry!B12)","v":"Ottawa Airport"},{"$f":"IF(ISBLANK(Expense_Entry!C12),\"\",Expense_Entry!C12)","v":"Parking"},{"$f":"IF(ISBLANK(Expense_Entry!D12),\"\",Expense_Entry!D12)","v":"Parking"},{"$f":"IF(ISBLANK(Expense_Entry!E12),\"\",Expense_Entry!E12)","v":"AMEX"},{"$f":"IF(ISBLANK(Expense_Entry!F12),\"\",Expense_Entry!F12)","v":"CAD"},{"$f":"IF(ISBLANK(Expense_Entry!G12),\"\",Expense_Entry!G12)","v":{"v":6,"d":"$6.00"}},{"v":7.49,"d":"$7.49"}]
[{"$f":"IF(ISBLANK(Expense_Entry!A13),\"\",Expense_Entry!A13)","v":"2011-03-11"},{"$f":"IF(ISBLANK(Expense_Entry!B13),\"\",Expense_Entry!B13)","v":"Cold Storage"},{"$f":"IF(ISBLANK(Expense_Entry!C13),\"\",Expense_Entry!C13)","v":"Dinner"},{"$f":"IF(ISBLANK(Expense_Entry!D13),\"\",Expense_Entry!D13)","v":"Meals"},{"$f":"IF(ISBLANK(Expense_Entry!E13),\"\",Expense_Entry!E13)","v":"AMEX"},{"$f":"IF(ISBLANK(Expense_Entry!F13),\"\",Expense_Entry!F13)","v":"SGD"},{"$f":"IF(ISBLANK(Expense_Entry!G13),\"\",Expense_Entry!G13)","v":{"v":8.6,"d":"$8.60"}},{"v":8.6,"d":"$8.60"}]
[{"$f":"IF(ISBLANK(Expense_Entry!A14),\"\",Expense_Entry!A14)","v":"2011-03-11"},{"$f":"IF(ISBLANK(Expense_Entry!B14),\"\",Expense_Entry!B14)","v":"Starbucks"},{"$f":"IF(ISBLANK(Expense_Entry!C14),\"\",Expense_Entry!C14)","v":"Coffee"},{"$f":"IF(ISBLANK(Expense_Entry!D14),\"\",Expense_Entry!D14)","v":"Meals"},{"$f":"IF(ISBLANK(Expense_Entry!E14),\"\",Expense_Entry!E14)","v":"AMEX"},{"$f":"IF(ISBLANK(Expense_Entry!F14),\"\",Expense_Entry!F14)","v":"SGD"},{"$f":"IF(ISBLANK(Expense_Entry!G14),\"\",Expense_Entry!G14)","v":{"v":7.9,"d":"$7.90"}},{"v":7.9,"d":"$7.90"}]
[{"$f":"IF(ISBLANK(Expense_Entry!A15),\"\",Expense_Entry!A15)","v":"2011-03-12"},{"$f":"IF(ISBLANK(Expense_Entry!B15),\"\",Expense_Entry!B15)","v":"Starbucks"},{"$f":"IF(ISBLANK(Expense_Entry!C15),\"\",Expense_Entry!C15)","v":"Coffee"},{"$f":"IF(ISBLANK(Expense_Entry!D15),\"\",Expense_Entry!D15)","v":"Meals"},{"$f":"IF(ISBLANK(Expense_Entry!E15),\"\",Expense_Entry!E15)","v":"AMEX"},{"$f":"IF(ISBLANK(Expense_Entry!F15),\"\",Expense_Entry!F15)","v":"CAD"},{"$f":"IF(ISBLANK(Expense_Entry!G15),\"\",Expense_Entry!G15)","v":{"v":4.71,"d":"$4.71"}},{"v":5.88,"d":"$5.88"}]
{"$rows_left_out":57}
{"sheet":"ExpenseDB","index":5,"n_rows":98,"n_cols":15,"rows_kept":98}
["Expense Database"]
[]
[null,"The purpose of this worksheet is to perform calculations on the entries in the Expense_Entry worksheet to produce all the possible values possibly needed to satisfy"]
[null,"   a corporate expense voucher submission."]
[]
[null,"Employee: ",{"$f":"Employee","v":"Employee Name"},{"$nulls":4},"Reimbursement Owed ",{"$f":"GETPIVOTDATA(\"Reim Amt.\",$A$73)","v":{"v":14259.83,"d":"$14,259.83"}},null,null,"Expense Gain/Loss: ",{"$f":"Actual_Reimbursed_Amt-Reimbursement_Owed","v":{"v":-59.82999999999993,"d":"$(59.83)"}}]
[null,"Reimbursement Currency: ",{"$f":"Reimbursement_Currency","v":"CAD"},{"$nulls":4},"Actual Reimbursed Amount: ",{"v":14200,"d":"$14,200.00"},null,{"$f":"IFERROR(IF(Expense_Gain_Loss<0,\"WARNING: unrecovered amount!\",\"\"),\"\")","v":"WARNING: unrecovered amount!"}]
[{"$nulls":9}," "]
[{"$nulls":7},"Reimbursement Data",{"$nulls":3},"Invoice Data"]
["Date","Establishment","Description","Type","Method","Currency","Exp. Amt.","R-Fx Rate Conv.","R-Fx Rate","Reim Amt.","a","I-Fx Rate Conv.","I-Fx Rate","Inv. Amt."]
[{"$f":"Expense_Entry!A11","v":"2011-03-11"},{"$f":"Expense_Entry!B11","v":"Mileage"},{"$f":"Expense_Entry!C11","v":"Drive to/from YOW (38 miles)"},{"$f":"Expense_Entry!D11","v":"Mileage"},{"$f":"Expense_Entry!E11","v":"Mileage"},{"$f":"Expense_Entry!F11","v":"USD"},{"$f":"Expense_Entry!G11","v":{"v":21.09,"d":"$21.09"}},{"$f":"IF(AND(F11<>\"\",Reimbursement_Currency<>\"\"),IF(F11=Reimbursement_Currency,STR_N_A,CONCATENATE(F11,STR_TO,Reimbursement_Currency)),\"\")","v":"USD to CAD"},{"$f":"IF(F11=Reimbursement_Currency,1,IF(G11=\"\",\"\",G11/Expense_Entry!$J11))","v":1.0672},{"$f":"IF(F11<>\"\",IF(Reimbursement_Currency=F11,G11,ROUND(G11/I11,2)),\"\")","v":{"v":19.76,"d":"$19.76"}},null,{"$f":"IF(AND(Client_Currency<>\"\",F11<>\"\"),IF(Client_Currency=F11,STR_N_A,CONCATENATE(F11,STR_TO,Client_Currency)),\"\")","v":"USD to SGD"},{"$f":"IF(G11=\"\",\"\",VLOOKUP(Client_Currency,Expense_Entry!FX_Rate_Tbl,2,FALSE())/VLOOKUP(F11,Expense_Entry!FX_Rate_Tbl,2,FALSE()))","v":{"v":1.3323290187891441,"d":"1.3323"}},{"$f":"IF(AND(Client_Currency<>\"\",F11<>\"\"),IF(Client_Currency=G11,G11,ROUND(G11*M11,2)),\"\")","v":{"v":28.1,"d":"$28.10"}}]
[{"$f":"Expense_Entry!A12","v":"2011-03-11"},{"$f":"Expense_Entry!B12","v":"Ottawa Airport"},{"$f":"Expense_Entry!C12","v":"Parking"},{"$f":"Expense_Entry!D12","v":"Parking"},{"$f":"Expense_Entry!E12","v":"AMEX"},{"$f":"Expense_Entry!F12","v":"CAD"},{"$f":"Expense_Entry!G12","v":{"v":6,"d":"$6.00"}},"N/A",{"$f":"IF(F12=Reimbursement_Currency,1,IF(G12=\"\",\"\",G12/Expense_Entry!$J12))","v":{"v":1,"d":"1.0000"}},{"v":6,"d":"$6.00"},null,"CAD to SGD",{"$f":"IF(G12=\"\",\"\",VLOOKUP(Client_Currency,Expense_Entry!FX_Rate_Tbl,2,FALSE())/VLOOKUP(F12,Expense_Entry!FX_Rate_Tbl,2,FALSE()))","v":{"v":1.2484342379958246,"d":"1.2484"}},{"v":7.49,"d":"$7.49"}]
[{"$f":"Expense_Entry!A13","v":"2011-03-11"},{"$f":"Expense_Entry!B13","v":"Cold Storage"},{"$f":"Expense_Entry!C13","v":"Dinner"},{"$f":"Expense_Entry!D13","v":"Meals"},{"$f":"Expense_Entry!E13","v":"AMEX"},{"$f":"Expense_Entry!F13","v":"SGD"},{"$f":"Expense_Entry!G13","v":{"v":8.6,"d":"$8.60"}},"SGD to CAD",{"$f":"IF(F13=Reimbursement_Currency,1,IF(G13=\"\",\"\",G13/Expense_Entry!$J13))","v":{"v":1.2609970674486803,"d":"1.2610"}},{"v":6.82,"d":"$6.82"},null,"N/A",{"$f":"IF(G13=\"\",\"\",VLOOKUP(Client_Currency,Expense_Entry!FX_Rate_Tbl,2,FALSE())/VLOOKUP(F13,Expense_Entry!FX_Rate_Tbl,2,FALSE()))","v":{"v":1,"d":"1.0000"}},{"v":8.6,"d":"$8.60"}]
[{"$f":"Expense_Entry!A14","v":"2011-03-11"},{"$f":"Expense_Entry!B14","v":"Starbucks"},{"$f":"Expense_Entry!C14","v":"Coffee"},{"$f":"Expense_Entry!D14","v":"Meals"},{"$f":"Expense_Entry!E14","v":"AMEX"},{"$f":"Expense_Entry!F14","v":"SGD"},{"$f":"Expense_Entry!G14","v":{"v":7.9,"d":"$7.90"}},"SGD to CAD",{"$f":"IF(F14=Reimbursement_Currency,1,IF(G14=\"\",\"\",G14/Expense_Entry!$J14))","v":{"v":1.2599681020733653,"d":"1.2600"}},{"v":6.27,"d":"$6.27"},null,"N/A",{"$f":"IF(G14=\"\",\"\",VLOOKUP(Client_Currency,Expense_Entry!FX_Rate_Tbl,2,FALSE())/VLOOKUP(F14,Expense_Entry!FX_Rate_Tbl,2,FALSE()))","v":{"v":1,"d":"1.0000"}},{"v":7.9,"d":"$7.90"}]
[{"$f":"Expense_Entry!A15","v":"2011-03-12"},{"$f":"Expense_Entry!B15","v":"Starbucks"},{"$f":"Expense_Entry!C15","v":"Coffee"},{"$f":"Expense_Entry!D15","v":"Meals"},{"$f":"Expense_Entry!E15","v":"AMEX"},{"$f":"Expense_Entry!F15","v":"CAD"},{"$f":"Expense_Entry!G15","v":{"v":4.71,"d":"$4.71"}},"N/A",{"$f":"IF(F15=Reimbursement_Currency,1,IF(G15=\"\",\"\",G15/Expense_Entry!$J15))","v":{"v":1,"d":"1.0000"}},{"v":4.71,"d":"$4.71"},null,"CAD to SGD",{"$f":"IF(G15=\"\",\"\",VLOOKUP(Client_Currency,Expense_Entry!FX_Rate_Tbl,2,FALSE())/VLOOKUP(F15,Expense_Entry!FX_Rate_Tbl,2,FALSE()))","v":{"v":1.2484342379958246,"d":"1.2484"}},{"v":5.88,"d":"$5.88"}]
{"$rows_left_out":84}
{"sheet":"NonReim_Summary","index":6,"n_rows":12,"n_cols":8,"rows_kept":12}
[null,{"$f":"Reim_Detail!A1","v":"Expense Report—Employee Name [ Week 14 ]"}]
[]
[null,{"$f":"Cover!B4","v":"Trip Start: "},{"$f":"Trip_Start","v":"2004-03-29"},{"$nulls":3},{"$f":"Reim_Detail!D3","v":"Total Amount: "},{"$f":"Total_Est_NonReim_Amt","v":0}]
[null,{"$f":"Cover!B5","v":"Trip End: "},{"$f":"Trip_End","v":"00:00:00"},{"$nulls":3},{"$f":"Reim_Detail!D4","v":"Client Currency: "},{"$f":"Reimbursement_Currency","v":"CAD"}]
[null,{"$f":"Cover!B6","v":"Client: "},{"$f":"Client","v":"Client Name"},{"$nulls":3},"Total Final Amount: ",{"$f":"Total_Est_NonReim_Amt+NonReim_Difference","v":0}]
[null,{"$f":"Cover!B7","v":"Destination: "},{"$f":"Destination","v":"Politsania"}]
[null,{"$f":"Cover!B8","v":"Purpose: "},{"$f":"Purpose","v":"Demo data"}]
[]
[null,"Sum of Home Amt.","Type"]
[null,"Date","(blank)","Grand Total"]
[null,"(blank)",{"v":0,"d":"$0.00"},{"v":0,"d":"$0.00"}]
[null,"Grand Total",{"v":0,"d":"$0.00"},{"v":0,"d":"$0.00"}]

{"sheet":"NonReim_Detail","index":7,"n_rows":31,"n_cols":11,"rows_kept":31}
[{"$f":"Cover!B1","v":"Expense Report—Employee Name [ Week 14 ]"}]
[]
[{"$f":"Cover!B4","v":"Trip Start: "},{"$f":"Trip_Start","v":"2004-03-29"},null,"Total Amount: ",{"$f":"Total_Est_NonReim_Amt","v":0},null,"Currency","FX Rate"]
[{"$f":"Cover!B5","v":"Trip End: "},{"$f":"Trip_End","v":"00:00:00"},{"$nulls":3},{"$f":"IF(H4=1,\"Home→\",\"\")","v":"Home→"},{"$f":"INDEX(Cover!FX_Names,ROW(G4)-3,1)","v":"CAD"},{"$f":"VLOOKUP(G4,Cover!FX_Rate_Tbl,2,FALSE)/VLOOKUP(Reimbursement_Currency,Cover!FX_Rate_Tbl,2,FALSE)","v":{"v":1,"d":"1.0000"}}]
[{"$f":"Cover!B6","v":"Client: "},{"$f":"Client","v":"Client Name"},{"$nulls":3},{"$f":"IF(H5=1,\"Home→\",\"\")","v":""},{"$f":"INDEX(Cover!FX_Names,ROW(G5)-3,1)","v":"USD"},{"$f":"VLOOKUP(G5,Cover!FX_Rate_Tbl,2,FALSE)/VLOOKUP(Reimbursement_Currency,Cover!FX_Rate_Tbl,2,FALSE)","v":{"v":0.9370314842578711,"d":"0.9370"}}]
[{"$f":"Cover!B7","v":"Destination: "},{"$f":"Destination","v":"Politsania"},{"$nulls":3},"",{"$f":"INDEX(Cover!FX_Names,ROW(G6)-3,1)","v":"SGD"},{"$f":"VLOOKUP(G6,Cover!FX_Rate_Tbl,2,FALSE)/VLOOKUP(Reimbursement_Currency,Cover!FX_Rate_Tbl,2,FALSE)","v":{"v":1.2484342379958246,"d":"1.2484"}}]
[{"$f":"Cover!B8","v":"Purpose: "},{"$f":"Purpose","v":"Demo data"},{"$nulls":3},"",{"$f":"INDEX(Cover!FX_Names,ROW(G7)-3,1)","v":"HKG"},{"$f":"VLOOKUP(G7,Cover!FX_Rate_Tbl,2,FALSE)/VLOOKUP(Reimbursement_Currency,Cover!FX_Rate_Tbl,2,FALSE)","v":{"v":7.807807807807808,"d":"7.8078"}},null,"Calculate Foreign"]
[{"$nulls":5},"",{"$f":"INDEX(Cover!FX_Names,ROW(G8)-3,1)","v":"Other 1"},{"$f":"VLOOKUP(G8,Cover!FX_Rate_Tbl,2,FALSE)/VLOOKUP(Reimbursement_Currency,Cover!FX_Rate_Tbl,2,FALSE)","v":0},null,"Currency Adjustment"]
[{"$nulls":7},"Estimated",null,"Actual"]
["Date","Establishment","Description","Type","Method","Currency","Exp. Amt.","Home Amt.","-","Levied Amt.","Difference"]
[{"$nulls":7},{"$f":"IF(OR(ISBLANK(F11),ISBLANK(G11)),\"\",ROUND(G11/VLOOKUP(F11,FX_Rate_Tbl,2,FALSE),2))","v":""},null,null,{"$f":"IF(Reimbursement_Currency=F11,0,IF(ISBLANK(J11),STR_TBD,ROUND(J11-(H11/VLOOKUP(Reimbursement_Currency,FX_Rate_Tbl,2)),2)))","v":"    TBD"}]
[{"$nulls":7},"",null,null,"    TBD"]
[{"$nulls":7},"",null,null,"    TBD"]
[{"$nulls":7},"",null,null,"    TBD"]
[{"$nulls":7},"",null,null,"    TBD"]
{"$rows_left_out":17}
{"sheet":"Rules","index":8,"n_rows":37,"n_cols":2,"rows_kept":37}
[]
[null,"Methods"]
[null,"Account"]
[null,"AMEX"]
[null,"Cash"]
[null,"Mileage"]
[null,"SBX"]
[null,"VISA"]
[]
[null,"Types"]
[null,"Airfare"]
[null,"Car Rental"]
[null,"Hotel"]
[null,"Meals"]
[null,"Mileage"]
{"$rows_left_out":23}
{"sheet":"ChangeLog","index":9,"n_rows":12,"n_cols":3,"rows_kept":12}
["Date","Vers.","Notes"]
["2004-08-10",10.1,"First public release."]
["2005-05-26",10.3,"Added extra rows to input sheet."]
["2005-06-04",{"v":11,"d":"11.0"},"Added extra ExpenseConversion sheet to meet head office data submision requirements."]
["2006-01-06",11.1,"Turned on protection for each sheet (no password)."]
["2006-07-04",{"v":12,"d":"12.0"},"Corrected currency conversion formulae."]
["2006-10-06",12.1,"Turned off protection & inserted new \"Mileage\" type."]
["2006-11-10",12.2,"Added Mileage & Account as Methods."]
["2007-01-06",12.3,"Added Mileage Rate field to cover page."]
["2008-07-12",12.8,"Added SBX Exepense Method & pivot tables to US Exchange worksheet."]
["2011-03-31",{"v":13,"d":"13.0"},"Attempted to fix some problems with formulae on the Reim_Detail tab.  There are still problems and the template requires a complete re-work."]
["2011-05-08",{"v":14,"d":"14.0"},"Rebuilt the template from scratch in Excel 2010.  No attempt was made to retain backward compatibility with old version of Excel."]